Skocz do zawartości

Polecane posty

Autor tematu Napisano

Witam, podczas kompilacji game mam błąd

 

#--# ERROR LOG GAME:





In file included from BattleArena.cpp:6:

char.h: In member function 'void CHARACTER::ClearPMCounter()':

char.h:544: error: 'm_iPMCounter' was not declared in this scope

char.h: In member function 'void CHARACTER::IncreasePMCounter()':

char.h:545: error: 'm_iPMCounter' was not declared in this scope

char.h: In member function 'int CHARACTER::GetPMCounter() const':

char.h:547: error: 'm_iPMCounter' was not declared in this scope

char.h: In member function 'int CHARACTER::GetLastPMPulse() const':

char.h:548: error: 'm_iLastPMPulse' was not declared in this scope

gmake: *** [OBJDIR/BattleArena.o] Bł±d 1

gmake: *** Oczekiwanie na niezakończone zadania....

In file included from ani.cpp:11:

char.h: In member function 'void CHARACTER::ClearPMCounter()':

char.h:544: error: 'm_iPMCounter' was not declared in this scope

char.h: In member function 'void CHARACTER::IncreasePMCounter()':

char.h:545: error: 'm_iPMCounter' was not declared in this scope

char.h: In member function 'int CHARACTER::GetPMCounter() const':

char.h:547: error: 'm_iPMCounter' was not declared in this scope

char.h: In member function 'int CHARACTER::GetLastPMPulse() const':

char.h:548: error: 'm_iLastPMPulse' was not declared in this scope

gmake: *** [OBJDIR/ani.o] Bł±d 1

In file included from OXEvent.cpp:9:

char.h: In member function 'void CHARACTER::ClearPMCounter()':

char.h:544: error: 'm_iPMCounter' was not declared in this scope

char.h: In member function 'void CHARACTER::IncreasePMCounter()':

char.h:545: error: 'm_iPMCounter' was not declared in this scope

char.h: In member function 'int CHARACTER::GetPMCounter() const':

char.h:547: error: 'm_iPMCounter' was not declared in this scope

char.h: In member function 'int CHARACTER::GetLastPMPulse() const':

char.h:548: error: 'm_iLastPMPulse' was not declared in this scope

gmake: *** [OBJDIR/OXEvent.o] Bł±d 1

a tutaj #--# char.h linia 541-551

 

    public:

        DWORD GetAIFlag() const { return m_pointsInstant.dwAIFlag; }

 

        void                ClearPMCounter(void){ m_iPMCounter = 0; }   // linia 544

        void                IncreasePMCounter(void){ m_iPMCounter++; }

        void                SetLastPMPulse(void);

        int                 GetPMCounter(void) const { return m_iPMCounter; }

        int                 GetLastPMPulse(void) const { return m_iLastPMPulse; }   // linia 548

 

        void                SetAggressive();

        bool                IsAggressive() const;

sb can help me

Udostępnij ten post


Link to postu
Pani Kasia

'VARIABLE' was not declared  in this scope.. hmm poważnie nic Ci to nie mówi skoro piszesz kod, a z forum kojarzę że nie jesteś świeżakiem xD

 

Pst zadeklaruj zmienne :>

Udostępnij ten post


Link to postu

Bądź aktywny! Zaloguj się lub utwórz konto

Tylko zarejestrowani użytkownicy mogą komentować zawartość tej strony

Utwórz konto

Zarejestruj nowe konto, to proste!

Zarejestruj nowe konto

Zaloguj się

Posiadasz własne konto? Użyj go!

Zaloguj się

  • Kto przegląda   0 użytkowników

    Brak zalogowanych użytkowników przeglądających tę stronę.


×
Okienko zamknie się za 5 sekund...