Skocz do zawartości

Nie kompiluje sie game


Rekomendowane odpowiedzi

Cześć , od jakiegoś czasu nie kompiluje mi się na ftp game.  podsyłam error loga. Jakieś pomysły ?

Spoiler

 

<spoiler>

In file included from char.cpp:4:
../../common/VnumHelper.h:59:32: warning: no newline at end of file
In file included from char.cpp:25:
shop_manager.h:40:7: warning: no newline at end of file
In file included from char.cpp:62:
PetSystem.h:163:31: warning: no newline at end of file
char.cpp:7217: warning: this decimal constant is unsigned only in ISO C90
char.cpp:7225:2: warning: no newline at end of file
In file included from char_battle.cpp:27:
shop_manager.h:40:7: warning: no newline at end of file
In file included from char_horse.cpp:14:
../../common/VnumHelper.h:59:32: warning: no newline at end of file
In file included from char_item.cpp:44:
../../common/VnumHelper.h:59:32: warning: no newline at end of file
In file included from char_item.cpp:47:
belt_inventory_helper.h:108:42: warning: no newline at end of file
In file included from PetSystem.cpp:8:
PetSystem.h:163:31: warning: no newline at end of file
In file included from PetSystem.cpp:9:
../../common/VnumHelper.h:59:32: warning: no newline at end of file
PetSystem.cpp:637:2: warning: no newline at end of file
In file included from char_state.cpp:25:
../../common/VnumHelper.h:59:32: warning: no newline at end of file
char.cpp: In member function 'void CHARACTER::PointChange(BYTE, int, bool, bool)':
char.cpp:3088: warning: comparison between signed and unsigned integer expressions
In file included from cmd_general.cpp:36:
../../common/VnumHelper.h:59:32: warning: no newline at end of file
PetSystem.cpp: In member function 'virtual bool CPetActor::_UpdateFollowAI()':
PetSystem.cpp:246: warning: unused variable 'bDoMoveAlone'
PetSystem.cpp: In member function 'CPetActor* CPetSystem::Summon(DWORD, CItem*, const char*, bool, DWORD)':
PetSystem.cpp:552: warning: unused variable 'petVID'
In file included from char_item.cpp:47:
belt_inventory_helper.h: In static member function 'static BYTE CBeltInventoryHelper::GetBeltGradeByRefineLevel(int)':
belt_inventory_helper.h:28: warning: comparison between signed and unsigned integer expressions
char_item.cpp: In member function 'bool CHARACTER::IsEmptyItemGrid(TItemPos, BYTE, int) const':
char_item.cpp:640: warning: comparison is always false due to limited range of data type
char_item.cpp:666: warning: comparison is always false due to limited range of data type
char_item.cpp: In member function 'bool CHARACTER::UseItemEx(CItem*, TItemPos)':
char_item.cpp:2387: warning: format '%d' expects type 'int', but argument 6 has type 'long int'
char_item.cpp:2391: warning: format '%d' expects type 'int', but argument 6 has type 'long int'
char_item.cpp:2403: warning: format '%d' expects type 'int', but argument 5 has type 'long int'
char_item.cpp:2407: warning: format '%d' expects type 'int', but argument 5 has type 'long int'
char_item.cpp:2434: warning: format '%d' expects type 'int', but argument 6 has type 'long int'
char_item.cpp:2442: warning: format '%d' expects type 'int', but argument 5 has type 'long int'
char_item.cpp:5087: warning: comparison between signed and unsigned integer expressions
char_item.cpp: In member function 'bool CHARACTER::UseItem(TItemPos, TItemPos)':
char_item.cpp:5159: warning: unused variable 'wDestCell'
char_item.cpp:5160: warning: unused variable 'bDestInven'
char_item.cpp: In member function 'bool CHARACTER::EquipItem(CItem*, int)':
char_item.cpp:6160: warning: array subscript has type 'char'
char_item.cpp: In member function 'void CHARACTER::BuffOnAttr_AddBuffsFromItem(CItem*)':
char_item.cpp:6224: warning: comparison between signed and unsigned integer expressions
char_item.cpp: In member function 'void CHARACTER::BuffOnAttr_RemoveBuffsFromItem(CItem*)':
char_item.cpp:6236: warning: comparison between signed and unsigned integer expressions
char_item.cpp: In member function 'bool CHARACTER::CanEquipNow(CItem*, const TItemPos&, const TItemPos&)':
char_item.cpp:7422: warning: unused variable 'itemType'
char_item.cpp:7423: warning: unused variable 'itemSubType'
char_item.cpp: In member function 'bool CHARACTER::IsEmptyItemGrid(TItemPos, BYTE, int) const':
char_item.cpp:679: warning: control reaches end of non-void function
char_state.cpp: In member function 'virtual void CHARACTER::StateMove()':
char_state.cpp:901: warning: unused variable 'rider'
constants.cpp:291: warning: this decimal constant is unsigned only in ISO C90
constants.cpp:292: warning: this decimal constant is unsigned only in ISO C90
constants.cpp:293: warning: this decimal constant is unsigned only in ISO C90
constants.cpp:294: warning: this decimal constant is unsigned only in ISO C90
constants.cpp:295: warning: this decimal constant is unsigned only in ISO C90
constants.cpp:296: warning: this decimal constant is unsigned only in ISO C90
constants.cpp:297: warning: this decimal constant is unsigned only in ISO C90
constants.cpp:298: warning: this decimal constant is unsigned only in ISO C90
constants.cpp:299: warning: this decimal constant is unsigned only in ISO C90
constants.cpp:300: warning: this decimal constant is unsigned only in ISO C90
constants.cpp:301: warning: this decimal constant is unsigned only in ISO C90
constants.cpp:302: warning: this decimal constant is unsigned only in ISO C90
constants.cpp:303: warning: this decimal constant is unsigned only in ISO C90
constants.cpp:304: warning: this decimal constant is unsigned only in ISO C90
constants.cpp:305: warning: this decimal constant is unsigned only in ISO C90
constants.cpp:306: warning: this decimal constant is unsigned only in ISO C90
constants.cpp:307: warning: this decimal constant is unsigned only in ISO C90
constants.cpp:308: warning: this decimal constant is unsigned only in ISO C90
constants.cpp:309: warning: this decimal constant is unsigned only in ISO C90
constants.cpp:310: warning: this decimal constant is unsigned only in ISO C90
constants.cpp:311: warning: this decimal constant is unsigned only in ISO C90
constants.cpp:187: error: too many initializers for 'const DWORD [106]'
constants.cpp:312: error: too many initializers for 'const DWORD [106]'
constants.cpp:437: error: too many initializers for 'const DWORD [106]'
constants.cpp:531: error: too many initializers for 'const DWORD [106]'
constants.cpp:953: error: too many initializers for 'const int [106]'
cmd_gm.cpp: In function 'void do_set_stat(CHARACTER*, const char*, int, int)':
cmd_gm.cpp:3935: warning: NULL used in arithmetic
gmake: *** [OBJDIR/constants.o] Bł±d 1
gmake: *** Oczekiwanie na niezakończone zadania....
In file included from config.cpp:22:
check_server.h: In static member function 'static bool CheckServer::CheckIp(const char*)':
check_server.h:24: warning: comparison between signed and unsigned integer expressions
config.cpp: In function 'void config_init(const std::string&)':
config.cpp:435: warning: NULL used in arithmetic
config.cpp:459: warning: NULL used in arithmetic
config.cpp:483: warning: NULL used in arithmetic
config.cpp:505: warning: unused variable 'line'
In file included from desc_manager.cpp:15:
ClientPackageCryptInfo.h:117:41: warning: no newline at end of file
char_item.cpp: In member function 'void CHARACTER::BuffOnAttr_ValueChange(BYTE, BYTE, BYTE)':
char_item.cpp:6271: warning: 'pBuff' may be used uninitialized in this function
cube.cpp: In function 'bool Cube_make(CHARACTER*)':
cube.cpp:544: warning: comparison between signed and unsigned integer expressions
cube.cpp: In function 'void Cube_MakeCubeInformationText()':
cube.cpp:716: warning: unused variable 'npcVNUM'
cube.cpp: In function 'bool Cube_InformationInitialize()':
cube.cpp:783: warning: comparison between signed and unsigned integer expressions
desc_client.cpp: In member function 'void CLIENT_DESC::UpdateChannelStatus(DWORD, bool)':
desc_client.cpp:299: warning: comparison between signed and unsigned integer expressions
cmd_gm.cpp: In function 'void do_use_item(CHARACTER*, const char*, int, int)':
cmd_gm.cpp:4357: warning: 'cell' may be used uninitialized in this function
cmd_gm.cpp: In function 'void do_set_stat(CHARACTER*, const char*, int, int)':
cmd_gm.cpp:3977: warning: 'n' may be used uninitialized in this function
cmd_gm.cpp: In function 'void do_mob_ld(CHARACTER*, const char*, int, int)':
cmd_gm.cpp:855: warning: 'x' may be used uninitialized in this function
cmd_gm.cpp:855: warning: 'y' may be used uninitialized in this function
</spoiler>

 

[EDIT]
Błąd naprawiony, dla osób którym się coś nie kompiluje, czytajcie Error logi :P Jak sie przypatrzy człowiek uważnie to idzie wszystko naprawić ;)

Edytowane przez qbeen13
Odnośnik do komentarza
  • Aive zablokował(a) ten temat
Gość
Ten temat został zamknięty. Brak możliwości dodania odpowiedzi.
  • Ostatnio przeglądający forum Nie kompiluje sie game   0 użytkowników
    • Brak zarejestrowanych użytkowników przeglądających tę stronę.
×
×
  • Dodaj nową pozycję...